{"text_format":"1","workbook":"xlsx","n_sheets":11,"sheets":["Night ONE","Night ONE-option 2","NIGHT TWO","NIGHT THREE","Championship Night","GPI Ranking-Seeding","Team SB Donations","Teams","32 team Bracketology","# of games per night","Team # Match ups"],"not_rendered":{"charts":0,"images":0,"macros":1,"external_links":0,"defined_names":3,"comments":0,"pivot_tables":0},"unopened":[],"bounds":{"document_bytes":16777216,"sheet_cells":100000,"rows_first":2000,"rows_last":500,"rows_between":2000,"halvings":0,"cell_chars":16384,"cell_head_chars":4096},"cells_cut":0,"cells_raw":0,"read":"whole","date_system":"1900"}

{"sheet":"Night ONE","index":0,"n_rows":50,"n_cols":24,"rows_kept":50,"cut":false,"hidden":false,"merged":[[0,6,0,7]]}
["Night 1- ALL at Springdale",null,null,null,"  - Teams Play each team within their own Bracket",null,"Score",null,null,null,null,null,"RESULTS- Night One"]
["# games","time","Courts","Bracket","HOME","AWAY","W","L","Winner","Pt Diff",null,"Division","Teams","Win","Loss",null,"Team #","# of Games",null,"Bracket","NO BREAK","30 MIN","60 MIN","90 MIN"]
[1,"06:00:00","court 1","C1","SARC- I'd Hit That","SO- Team Kona",21,13,"SO- Team Kona",{"$f":"G3-H3","v":8},null,"A","LKP- Will Play for Sets",{"$f":"COUNTIF(I$3:I$50,M3)","v":2},{"$f":"3-N3","v":1},null,1,3,null,"A"]
[2,null,"court 2","C1","SARC- Good Bumps, Nice Sets","SARC- Sets on the Beach",21,12,"SARC- Sets on the Beach",{"$f":"G4-H4","v":9},null,"A","LKP- Pass It Around",{"$f":"COUNTIF(I$3:I$50,M4)","v":2},1,null,2,3,null,"B"]
[3,null,"court 3","C2","LKP- Casual Sets","CT- Volley Llamas",21,14,"LKP- Casual Sets",7,null,"A","CT- Spikological Warfare",0,3,null,3,3,null,"C"]
[4,null,"court 4","C2","HG- Swingrays","GS- 50 Shades of Greystone",21,18,"HG- Swingrays",3,null,"A","NR- Hit That Thang",0,3,null,4,3,null,"D"]
[5,null,"court 5","B2","LKP- Bumpn' Uglies","LKP- Block You Like a Hurricane",21,18,"LKP- Block You Like a Hurricane",3,null,"A","NR- Six Pack Attack",1,2,null,5,3,null,"E"]
[6,null,"court 6","B2","GS- Sand Gators","GS- Vicious & Delicious",21,3,"GS- Sand Gators",18,null,"A","SARC- Volleywood",2,1,null,6,3,null,"F"]
[7,"06:30:00","court 1","A1","NR- Six Pack Attack","SARC- Volleywood",21,7,"SARC- Volleywood",14,null,"A","SO- Kiss My Ace",2,1,null,7,3,null,"G"]
[8,null,"court 2","A1","LKP- Air Vectors","CT- Spikological Warfare",21,11,"LKP- Air Vectors",10,null,"A","LKP- Air Vectors",3,0,null,8,3,null,"H"]
{"$rows_left_out":41}
{"sheet":"Night ONE-option 2","index":1,"n_rows":50,"n_cols":14,"rows_kept":50,"cut":false,"hidden":true,"merged":[]}
["Night 1","ALL at Springdale"]
["# games","time","Courts",null,null,null,null,null,null,null,"NO BREAK","30 MIN","60 MIN","90 MIN"]
[1,"06:00:00","court 1","C",9,10,null,null,null,"A",null,1,1]
[2,null,"court 2","C",11,12,null,null,null,"B",null,1,1]
[3,null,"court 3","D",13,14,null,null,null,"C",null,1,1]
[4,null,"court 4","D",15,16,null,null,null,"D",null,1,1]
[5,null,"court 5","E",17,18,null,null,null,"E",null,1,1]
[6,null,"court 6","E",19,20,null,null,null,"F",null,null,1,1]
[7,"06:30:00","court 1","A",1,2,null,null,null,"G",null,1,1]
[8,null,"court 2","A",3,4,null,null,null,"H",null,1,1]
{"$rows_left_out":41}
{"sheet":"NIGHT TWO","index":2,"n_rows":145,"n_cols":28,"rows_kept":145,"cut":false,"hidden":false,"merged":[[0,6,0,7],[19,6,19,7],[61,6,61,7]]}
["Lake Park  A1 VS A2 Brackets  (A Division)",null,null,null,null,null,"Score",null,null,null,null,null,"RESULTS- After Night Two"]
[null,null,null,"Division","HOME","AWAY","W","L","Winner","Pt Diff",null,"Division","Teams","Win","Loss",null,null,null,"Teams on Lake Park",null,"Team","No Break","30 min","60 min",null,null,"ct 1","ct 3"]
[1,"06:00:00","court 1","A","SARC- Volleywood","NR- Hit That Thang",21,7,"SARC- Volleywood",{"$f":"G3-H3","v":14},null,"A","LKP- Will Play for Sets",{"$f":"COUNTIF('Night ONE'!I$3:I$50,M3)+COUNTIF(I$3:I$145,M3)","v":4},{"$f":"7-N3","v":3},null,null,null,"SARC- Volleywood",null,1,null,3,null,null,1,2,2]
[2,null,"court 2","A","NR- Six Pack Attack","LKP- Pass It Around",21,16,"LKP- Pass It Around",{"$f":"G4-H4","v":5},null,"A","LKP- Pass It Around",{"$f":"COUNTIF('Night ONE'!I$3:I$50,M4)+COUNTIF(I$3:I$145,M4)","v":5},2,null,null,null,"NR- Six Pack Attack",null,2,null,3,null,null,2,2,2]
[3,"06:30:00","court 1","A","CT- Spikological Warfare","SO- Kiss My Ace",21,9,"CT- Spikological Warfare",12,null,"A","CT- Spikological Warfare",{"$f":"COUNTIF('Night ONE'!I$3:I$50,M5)+COUNTIF(I$3:I$145,M5)","v":2},5,null,null,null,"CT- Spikological Warfare",null,3,null,3,null,null,3,2,2]
[4,null,"court 2","A","LKP- Air Vectors","LKP- Will Play for Sets",21,10,"LKP- Air Vectors",11,null,"A","NR- Hit That Thang",{"$f":"COUNTIF('Night ONE'!I$3:I$50,M6)+COUNTIF(I$3:I$145,M6)","v":1},6,null,null,null,"LKP- Air Vectors",null,4,null,3,null,null,4,2,2]
[5,"07:00:00","court 1","A","SARC- Volleywood","LKP- Pass It Around",21,11,"LKP- Pass It Around",10,null,"A","NR- Six Pack Attack",{"$f":"COUNTIF('Night ONE'!I$3:I$50,M7)+COUNTIF(I$3:I$145,M7)","v":2},5,null,null,null,"NR- Hit That Thang",null,5,null,2,1,null,5,2,2]
[6,null,"court 2","A","NR- Six Pack Attack","NR- Hit That Thang",21,18,"NR- Hit That Thang",3,null,"A","SARC- Volleywood",{"$f":"COUNTIF('Night ONE'!I$3:I$50,M8)+COUNTIF(I$3:I$145,M8)","v":5},2,null,null,null,"LKP- Pass It Around",null,6,null,2,1,null,6,2,2]
[7,"07:30:00","court 1","A","CT- Spikological Warfare","LKP- Will Play for Sets",21,17,"LKP- Will Play for Sets",4,null,"A","SO- Kiss My Ace",{"$f":"COUNTIF('Night ONE'!I$3:I$50,M9)+COUNTIF(I$3:I$145,M9)","v":2},5,null,null,null,"SO- Kiss My Ace",null,7,1,2,null,null,7,2,2]
[8,null,"court 2","A","LKP- Air Vectors","SO- Kiss My Ace",21,9,"LKP- Air Vectors",12,null,"A","LKP- Air Vectors",{"$f":"COUNTIF('Night ONE'!I$3:I$50,M10)+COUNTIF(I$3:I$145,M10)","v":7},0,null,null,null,"LKP- Will Play for Sets",null,8,1,2,null,null,8,2,2]
{"$rows_left_out":136}
{"sheet":"NIGHT THREE","index":3,"n_rows":81,"n_cols":31,"rows_kept":81,"cut":false,"hidden":false,"merged":[[0,6,0,7],[21,6,21,7],[63,6,63,7],[42,6,42,7]]}
["SARC Red-   1st Vertical Bracket Cross-section of Divisions",null,null,null,null,null,"Score",null,null,null,null,null,"RESULTS- After Night Three"]
[null,null,null,null,"HOME","AWAY","W","L","Winner","Pt Diff",null,"Division","2017 Teams","Win","Loss",".","PT DIFF",null,"Teams on SARC Red Courts",null,null,null,null,"Team","No Break","30 min","60 min",null,null,"ct 1","ct 2"]
[1,"06:00:00","court 1",null,"SARC- Sand Diggers","SARC- I'd Hit That",21,3,"SARC- Sand Diggers",{"$f":"G3-H3","v":18},null,"A","LKP- Will Play for Sets",{"$f":"COUNTIF('Night ONE'!I$3:I$50,M3)+COUNTIF('NIGHT TWO'!I$3:I$149,M3)+COUNTIF(I$3:I$81,M3)","v":7},{"$f":"11-N3","v":4},null,26,null,"SARC- Sand Diggers",null,null,null,null,1,1,null,2,null,1,2,2]
[2,null,"court 3",null,"SARC- Raleigh Brawl","SARC- Volleywood",21,9,"SARC- Volleywood",{"$f":"G4-H4","v":12},null,"A","LKP- Pass It Around",{"$f":"COUNTIF('Night ONE'!I$3:I$50,M4)+COUNTIF('NIGHT TWO'!I$3:I$149,M4)+COUNTIF(I$3:I$81,M4)","v":8},3,null,44,null,"SARC- Mizfits",null,null,null,null,2,1,1,1,null,2,2,2]
[3,"06:30:00","court 1",null,"SARC- Mizfits","SO- Team Kona",21,8,"SO- Team Kona",13,null,"A","CT- Spikological Warfare",{"$f":"COUNTIF('Night ONE'!I$3:I$50,M5)+COUNTIF('NIGHT TWO'!I$3:I$149,M5)+COUNTIF(I$3:I$81,M5)","v":6},5,null,56,null,"SARC- $et for Life",null,null,null,null,9,1,2,null,null,9,2,2]
[4,null,"court 3",null,"NR- Six Pack Attack","SARC- Sand Diggers",21,19,"NR- Six Pack Attack",2,null,"A","NR- Hit That Thang",{"$f":"COUNTIF('Night ONE'!I$3:I$50,M6)+COUNTIF('NIGHT TWO'!I$3:I$149,M6)+COUNTIF(I$3:I$81,M6)","v":3},8,null,-68,null,"SARC- Raleigh Brawl",null,null,null,null,10,1,1,1,null,10,2,2]
[5,"07:00:00","court 1",null,"SARC- Volleywood","SARC- $et for Life",21,19,"SARC- Volleywood",2,null,"A","NR- Six Pack Attack",{"$f":"COUNTIF('Night ONE'!I$3:I$50,M7)+COUNTIF('NIGHT TWO'!I$3:I$149,M7)+COUNTIF(I$3:I$81,M7)","v":5},6,null,-15,null,"SARC- I'd Hit That",null,null,null,null,17,1,1,1,null,17,2,2]
[6,null,"court 3",null,"SARC- I'd Hit That","SARC- Mizfits",21,5,"SARC- I'd Hit That",16,null,"A","SARC- Volleywood",{"$f":"COUNTIF('Night ONE'!I$3:I$50,M8)+COUNTIF('NIGHT TWO'!I$3:I$149,M8)+COUNTIF(I$3:I$81,M8)","v":8},3,null,56,null,"NR- Six Pack Attack",null,null,null,null,18,null,3,null,null,18,2,2]
[7,"07:30:00","court 1",null,"SO- Team Kona","SARC- Raleigh Brawl",21,9,"SO- Team Kona",12,null,"A","SO- Kiss My Ace",{"$f":"COUNTIF('Night ONE'!I$3:I$50,M9)+COUNTIF('NIGHT TWO'!I$3:I$149,M9)+COUNTIF(I$3:I$81,M9)","v":5},{"$f":"11-N9","v":6},null,-10,null,"SO- Team Kona",null,null,null,null,25,1,2,null,null,25,2,2]
[8,null,"court 3",null,"NR- Six Pack Attack","SARC- I'd Hit That",21,18,"NR- Six Pack Attack",3,null,"A","LKP- Air Vectors",{"$f":"COUNTIF('Night ONE'!I$3:I$50,M10)+COUNTIF('NIGHT TWO'!I$3:I$149,M10)+COUNTIF(I$3:I$81,M10)","v":11},0,null,105,null,"SARC- Volleywood",null,null,null,null,26,null,3,null,null,26,2,2]
{"$rows_left_out":72}
{"sheet":"Championship Night","index":4,"n_rows":69,"n_cols":21,"rows_kept":69,"cut":false,"hidden":false,"merged":[[4,15,7,15]]}
[null,"Growler Championship Night- 32 Team Single Elimination",null,null,null,null,null,null,null,"Final Seeding ",null,null,null,null,null,"Raffle","Final 4",null,"Championship"]
[]
[]
[null,"17:30:00",null,"18:00:00",null,"18:30:00",null,"19:00:00",null,"19:30:00",null,"20:00:00",null,"20:30:00",null,"21:00:00","21:30:00",null,"22:00:00"]
[null,null,null,null,null,null,null,null,null,null,null,null,null,null,null,"Break for Announce-ments and Raffle"]
[null,null,null,null,1,"LKP- Air Vectors"]
[null,null,null,null,null,1,null,null,null,"LKP- Air Vectors"]
[null,null,null,null,32,"GS- Rhymes with Stupid"]
[null,null,null,null,null,"court 1",null,null,null,17,null,null,null,"LKP- Air Vectors"]
[16,"LKP- Casual Sets"]
{"$rows_left_out":60}
{"sheet":"GPI Ranking-Seeding","index":5,"n_rows":36,"n_cols":24,"rows_kept":36,"cut":false,"hidden":false,"merged":[[0,4,0,6],[0,2,0,3],[0,7,0,9],[0,10,0,11],[1,7,1,8]]}
[2017,"Final SEEDING ","#1- Strength of Schedule",null,"#2- NUMBER OF WINS",null,null,"#3- POINT DIFFERENTIAL",null,null,"#4- MONEY FOR ST BALDRICKS",null,null,null,null,null,"Point Differential"]
[{"$f":"'Team SB Donations'!#REF!","v":{"$error":"#REF!"}},"Method for Determining Points >>>>>>>>>>>>>>>","Points","A= 8 pts,      B=5 pts,       C= 2 pts,      D= 0 pts",null,"Points","= # of Wins","Ranking",null,"=(32-Rank)/7","Ranking","=(32-Rank)/5","Total Pts from Wins, Pt Diff, Tier Diff, Money raised",null,null,null,null,"Division","Teams","Win","Loss",".","PT DIFF","Rank"]
[null,"Point Variance",null,8,null,null,11,null,null,4.4000000000000004,null,6,null,null,null,null,null,null,"LKP- Air Vectors",null,null,null,{"$f":"VLOOKUP(S3,'NIGHT THREE'!M$3:Q$34,5,FALSE)","v":105},1]
["Ranking","Teams","Team Level","Points for Division Difficulty","Win","Loss","Points from W/L","POINT DIFFERENTIAL","Pt Diff Rank","Points from Pt Diff ","Rank- Money Raised for St Baldricks or Sponsorship","POINTS for Money Raised for St Baldricks or Sponsorship","TOTAL POINTS",null,null,null,null,null,"SARC- $et for Life",null,null,null,{"$f":"VLOOKUP(S4,'NIGHT THREE'!M$3:Q$34,5,FALSE)","v":72},2]
[1,"LKP- Air Vectors","A",{"$f":"IF(C5=\"A\",8,IF(C5=\"B\",5,IF(C5=\"C\",2,0)))","v":8},{"$f":"VLOOKUP(B5,'NIGHT THREE'!M$3:N$34,2,FALSE)","v":11},{"$f":"VLOOKUP(B5,'NIGHT THREE'!M$3:O$34,3,FALSE)","v":0},{"$f":"E5","v":11},{"$f":"VLOOKUP(B5,'NIGHT THREE'!M$3:Q$34,5,FALSE)","v":105},{"$f":"VLOOKUP($B5,S$3:X$34,6,FALSE)","v":1},{"$f":"(32-I5)/7","v":4.4285714285714288},{"$f":"VLOOKUP($B5,'Team SB Donations'!B$5:L$36,11,FALSE)","v":16},{"$f":"(32-K5)/5","v":3.2},{"$f":"G5+J5+D5+L5","v":26.62857142857143},null,null,null,null,null,"CT- Spikological Warfare",null,null,null,{"$f":"VLOOKUP(S5,'NIGHT THREE'!M$3:Q$34,5,FALSE)","v":56},3]
[2,"LKP- Pass It Around","A",8,{"$f":"VLOOKUP(B6,'NIGHT THREE'!M$3:N$34,2,FALSE)","v":8},{"$f":"VLOOKUP(B6,'NIGHT THREE'!M$3:O$34,3,FALSE)","v":3},8,{"$f":"VLOOKUP(B6,'NIGHT THREE'!M$3:Q$34,5,FALSE)","v":44},8,3.4285714285714284,{"$f":"VLOOKUP($B6,'Team SB Donations'!B$5:L$36,11,FALSE)","v":13},3.8,23.228571428571431,null,null,null,null,null,"SARC- Volleywood",null,null,null,{"$f":"VLOOKUP(S6,'NIGHT THREE'!M$3:Q$34,5,FALSE)","v":56},4]
[3,"SARC- Volleywood","A",8,{"$f":"VLOOKUP(B7,'NIGHT THREE'!M$3:N$34,2,FALSE)","v":8},{"$f":"VLOOKUP(B7,'NIGHT THREE'!M$3:O$34,3,FALSE)","v":3},8,{"$f":"VLOOKUP(B7,'NIGHT THREE'!M$3:Q$34,5,FALSE)","v":56},4,4,{"$f":"VLOOKUP($B7,'Team SB Donations'!B$5:L$36,11,FALSE)","v":24},1.6,21.6,null,null,null,null,null,"SARC- Dirt Devils",null,null,null,{"$f":"VLOOKUP(S7,'NIGHT THREE'!M$3:Q$34,5,FALSE)","v":53},5]
[4,"GS- El Toro's Revenge","D",0,{"$f":"VLOOKUP(B8,'NIGHT THREE'!M$3:N$34,2,FALSE)","v":7},{"$f":"VLOOKUP(B8,'NIGHT THREE'!M$3:O$34,3,FALSE)","v":4},7,{"$f":"VLOOKUP(B8,'NIGHT THREE'!M$3:Q$34,5,FALSE)","v":40},10,3.1428571428571428,{"$f":"VLOOKUP($B8,'Team SB Donations'!B$5:L$36,11,FALSE)","v":1},6.2,16.342857142857142,"El TORO #4 seed",null,null,null,null,"SO- Team Kona",null,null,null,{"$f":"VLOOKUP(S8,'NIGHT THREE'!M$3:Q$34,5,FALSE)","v":52},6]
[5,"CT- Spikological Warfare","A",8,{"$f":"VLOOKUP(B9,'NIGHT THREE'!M$3:N$34,2,FALSE)","v":6},{"$f":"VLOOKUP(B9,'NIGHT THREE'!M$3:O$34,3,FALSE)","v":5},6,{"$f":"VLOOKUP(B9,'NIGHT THREE'!M$3:Q$34,5,FALSE)","v":56},3,4.1428571428571432,{"$f":"VLOOKUP($B9,'Team SB Donations'!B$5:L$36,11,FALSE)","v":15},3.4,21.542857142857141,null,null,null,null,null,"LKP- Block You Like a Hurricane",null,null,null,{"$f":"VLOOKUP(S9,'NIGHT THREE'!M$3:Q$34,5,FALSE)","v":45},7]
[6,"GS- Sand Gators","B",5,{"$f":"VLOOKUP(B10,'NIGHT THREE'!M$3:N$34,2,FALSE)","v":8},{"$f":"VLOOKUP(B10,'NIGHT THREE'!M$3:O$34,3,FALSE)","v":3},8,{"$f":"VLOOKUP(B10,'NIGHT THREE'!M$3:Q$34,5,FALSE)","v":42},9,3.2857142857142856,{"$f":"VLOOKUP($B10,'Team SB Donations'!B$5:L$36,11,FALSE)","v":6},5.2,21.485714285714284,null,null,null,null,null,"LKP- Pass It Around",null,null,null,{"$f":"VLOOKUP(S10,'NIGHT THREE'!M$3:Q$34,5,FALSE)","v":44},8]
{"$rows_left_out":27}
{"sheet":"Team SB Donations","index":6,"n_rows":36,"n_cols":20,"rows_kept":36,"cut":false,"hidden":false,"merged":[]}
[null,null,null,null,null,null,null,null,null,null,null,null,null,"St Baldrick's Download Team Report"]
[null,null,null,null,null,null,null,null,null,null,null,null,null,2018]
[null,1,2,3,4,5,6,7,8,9,10,11,null,"SB report downloaded 8/19 6pm"]
[null,"Schedule Name","SB- Team Name","# of Participants","Team Captain Full Name",null,null,"Amount Raised on SB Site","Sponsorships Cash earned- Adjustments","Cash Sponsors acquired (checks to SARC), other SB credits, or Adjustments ","Total- Team Earnings","Growler SB Team Rank",null,"Registration Date","Team Name","# of Participants","Team Captain Full Name","Team Captain Display Name","Team Fundraising Goal","Amount Raised"]
[null,"GS- El Toro's Revenge","El toro",null,"Joe  Cockerham",null,null,{"$f":"VLOOKUP(C5,O$5:T$36,6,FALSE)","v":18970.009999999998},-7762,"Apply 50 % of El Toro to V & D (Lindsay/Brooke)",{"$f":"SUM(H5:I5)","v":11208.009999999998},1,null,"2018-05-08","Air Vectors",4,"Lawrence R Lee","Lawrence Lee",300,925]
[null,"SARC- Sand Diggers","Sand Diggers",null,"John M Marks",null,null,6849,3350,"Alvis Dent $250 , Wells Dent $500, RabonDaily $250,  D Jacobs-lights 1600, Campbell 750",10199,2,null,"2018-05-10","Bump'n Uglies",1,"Kenneth  Muller","Kenneth Muller",1000,500]
[null,"GS- Vicious & Delicious","Vicious and Delicious",null,"Michael D Braga",null,null,300,8762,"Apply 50 % of El Toro to V & D (Lindsay/Brooke), SouthernResearch $1000 check sent to SB",9062,3,null,"2018-05-10","Hit That Thang",2,"Steve  Hamilton","Steve Hamilton",1000,735]
[null,"SO- Kiss My Ace","Kiss My Ace!",null,"Olaf  Schroeder",null,null,5805,null,null,5805,4,null,"2018-05-10","El toro",6,"Joe  Cockerham","Joe Cockerham",500,18970.009999999998]
[null,"SARC- Mizfits","Mizfits",null,"Jay W Cupstid",null,null,2478,2350,"BTM Landscape (350),  Alvis Dent 250, Cornerstone $1500,  SMVT 250 ",4828,5,null,"2018-05-10","Raleigh Brawl",1,"Rob S Caulfield","Rob Caulfield",500,0]
[null,"GS- Sand Gators","Sand Gators",null,"Jeff  Sharp",null,null,2090,1200,"NC Sp Hosp ($250), Northstate (S200), Courtyard ($250). One Off clothing ($500)",3290,6,null,"2018-05-11","Casual Sets",1,"Dave  Radcliffe","Dave Radcliffe",500,100]
{"$rows_left_out":27}
{"sheet":"Teams","index":7,"n_rows":64,"n_cols":25,"rows_kept":64,"cut":false,"hidden":false,"merged":[]}
[]
[]
[]
[]
[]
[]
[]
[]
[]
[]
{"$rows_left_out":55}
{"sheet":"32 team Bracketology","index":8,"n_rows":39,"n_cols":20,"rows_kept":39,"cut":false,"hidden":false,"merged":[]}
["32 TEAM BRACKETOLOGY-  The method to this schedule Madness"]
[]
["Night 1","All at SARC- Play Within Your Bracket"]
[null,"Teams play a round robin with 3 teams in their same Bracket"]
[null," 8 Brackets of 4- 3 games each  "]
["Bracket",null,null,null,null,"Bracket"]
["A1",1,2,3,4,"A2",5,6,7,8,null,"A Division "]
[]
["C1",9,10,11,12,"C2",13,14,15,16,null,"C Division"]
[]
{"$rows_left_out":30}
{"sheet":"# of games per night","index":9,"n_rows":50,"n_cols":18,"rows_kept":50,"cut":false,"hidden":false,"merged":[]}
["Night 1","ALL at Springdale",null,null,null,null,null,null,null,null,"Nights 2 and 3",null,"  - 3 HOST CLUBS (SARC, LKP, and GS)"]
["# games","time","Courts",null,null,null,null,null,null,null,null,null,"8 courts at 4 Sites w/ SARC counting as 2 Sites"]
[1,"06:00:00","court 1",null,"32 teams",null,null,null,null,null,null,null,null,"SARC Red and SARC Bluelue to be one perm court and one temp sand court"]
[2,null,"court 2",null,"3 games each",null,null,null,null,null,1,6,"court 1"]
[3,null,"court 3",null,"(32*3)/2",null,null,null,null,null,2,null,"court 2",null,"SARC Red","SARC Blue","LPK","GS"]
[4,null,"court 4",null,{"$f":"(32*3)/2","v":48},null,null,"# of games",null,null,3,"06:30:00","court 1",null,"2 courts","2 courts","2 courts","2 courts"]
[5,null,"court 5",null,null,null,null,null,null,null,4,null,"court 2",null,"8 teams","8 teams","8 teams","8 teams"]
[6,null,"court 6",null,null,null,null,null,null,null,5,7,"court 1"]
[7,"06:30:00","court 1",null,"4 total Sand courts at SARC w/ 2 temp Sand",null,null,null,null,null,6,null,"court 2",null,"Each Site- 8 teams"]
[8,null,"court 2",null,"Courts 3 and 4 are temporary sand courts on the soccer field",null,null,null,null,null,7,"07:30:00","court 1",null,"4 games each",null,"# of Games"]
{"$rows_left_out":41}
{"sheet":"Team # Match ups","index":10,"n_rows":51,"n_cols":33,"rows_kept":51,"cut":false,"hidden":false,"merged":[]}
["Night 1",null,null,null,null,null,null,null,null,null,null,null,"Night 2",null,null,null,null,null,null,null,null,null,null,null,"Night 3"]
[]
["# games","Bracket","Team  VS","Team",null,null,null,null,null,null,null,null,"# games","Bracket","Team  VS","Team",null,null,"# games","Bracket","Team  VS","Team",null,null,"# games","Bracket","Team  VS","Team",null,"# games","Bracket","Team  VS","Team"]
[1,"A",1,2,null,null,null,null,null,null,null,null,1,"SARC Red",1,5,null,null,1,"SARC Blue",17,21,null,null,1,"SARC Red",1,9,null,1,"LPK",5,13]
[2,"A",1,3,null,null,null,null,null,null,null,null,2,"SARC Red",1,6,null,null,2,"SARC Blue",17,22,null,null,2,"SARC Red",1,17,null,2,"LPK",5,21]
[3,"A",4,1,null,null,null,null,null,null,null,null,3,"SARC Red",7,1,null,null,3,"SARC Blue",23,17,null,null,3,"SARC Red",25,1,null,3,"LPK",29,5]
[4,"A",2,3,null,null,null,null,null,null,null,null,4,"SARC Red",8,1,null,null,4,"SARC Blue",24,17,null,null,4,"SARC Red",17,9,null,4,"LPK",21,13]
[5,"A",2,4,null,null,null,null,null,null,null,null,5,"SARC Red",2,5,null,null,5,"SARC Blue",18,21,null,null,5,"SARC Red",9,25,null,5,"LPK",13,29]
[6,"A",3,4,null,null,null,null,null,null,null,null,6,"SARC Red",2,6,null,null,6,"SARC Blue",18,22,null,null,6,"SARC Red",17,25,null,6,"LPK",21,29]
[7,"B",5,6,null,null,null,null,null,null,null,null,7,"SARC Red",7,2,null,null,7,"SARC Blue",23,18,null,null,7,"SARC Red",10,1,null,7,"LPK",14,5]
{"$rows_left_out":41}