{"text_format":"1","workbook":"xlsx","n_sheets":11,"sheets":["Night ONE","Night ONE-option 2","NIGHT TWO","NIGHT THREE","Championship Night","Team SB Donations","GPI Ranking-Seeding","Teams","32 team Bracketology","# of games per night","Team # Match ups"],"not_rendered":{"charts":0,"images":0,"macros":1,"external_links":0,"defined_names":3,"comments":0,"pivot_tables":0},"unopened":[],"bounds":{"document_bytes":16777216,"sheet_cells":100000,"rows_first":2000,"rows_last":500,"rows_between":2000,"halvings":0,"cell_chars":16384,"cell_head_chars":4096},"cells_cut":0,"cells_raw":0,"read":"whole","date_system":"1900"}

{"sheet":"Night ONE","index":0,"n_rows":50,"n_cols":24,"rows_kept":50,"cut":false,"hidden":false,"merged":[[0,6,0,7]]}
["Night 1- ALL at Springdale",null,null,null,"  - Teams Play each team within their own Bracket",null,"Score",null,null,null,null,null,"RESULTS- Night One"]
["# games","time","Courts","Bracket","HOME","AWAY","W","L","Winner","Pt Diff",null,"Division","Teams","Win","Loss",null,"Team #","# of Games",null,"Bracket","NO BREAK","30 MIN","60 MIN","90 MIN"]
[1,"06:00:00","court 1","C","SARC- $et for Life","SARC- Dirt Devils",21,4,"SARC- $et for Life",{"$f":"G3-H3","v":17},null,"A","SO- Kiss My Ace",{"$f":"COUNTIF(I$3:I$50,M3)","v":2},{"$f":"3-N3","v":1},null,1,3,null,"A",null,null,2]
[2,null,"court 2","C","SARC- Mojo Risin ","SARC- Good Bumps, Nice Sets",21,16,"SARC- Good Bumps, Nice Sets",{"$f":"G4-H4","v":5},null,"A","LKP- Air Vectors",{"$f":"COUNTIF(I$3:I$50,M4)","v":1},2,null,2,3,null,"B",null,1,1]
[3,null,"court 3","D","HG- Swingrays","LKP- Block You Like a Hurricane",21,14,"LKP- Block You Like a Hurricane",7,null,"A","SARC- Volleywood",2,1,null,3,3,null,"C",null,1,1]
[4,null,"court 4","D","GS- Dirty Sets on Tuesday","GS- Sand Gators",21,11,"GS- Sand Gators",10,null,"A","LKP- Pass It Around",1,2,null,4,3,null,"D",null,2]
[5,null,"court 5","F","NR- Hit That Thang","SARC- I'd Hit That",21,19,"NR- Hit That Thang",2,null,"A","LKP- Casual Sets",1,2,null,5,3,null,"E",null,1,1]
[6,null,"court 6","F","CT- Concrete Feet","GS- Rhymes with Stupid",21,10,"CT- Concrete Feet",11,null,"A","NR- Six Pack Attack",3,0,null,6,3,null,"F",null,2]
[7,"06:30:00","court 1","A","SO- Kiss My Ace","LKP- Air Vectors",21,17,"SO- Kiss My Ace",4,null,"A","LKP- Will Play for Sets",2,1,null,7,3,null,"G",null,null,2]
[8,null,"court 2","A","SARC- Volleywood","LKP- Pass It Around",21,12,"SARC- Volleywood",9,null,"A","GS- 50 Shades of Greystone",0,3,null,8,3,null,"H",null,1,1]
[9,null,"court 3","G","SARC- Mizfits","SARC- Sets on the Beach",21,11,"SARC- Sets on the Beach",10,null,"B","SARC- Raleigh Brawl",2,1,null,9,3]
[10,null,"court 4","G","SARC- Here for Beer","SPN- Team Sponsors",21,19,"SARC- Here for Beer",2,null,"B","SARC- Notorious D.I.G.",0,3,null,10,3]
[11,null,"court 5","E","SARC- Raleigh Brawl","SARC- Notorious D.I.G.",21,9,"SARC- Raleigh Brawl",12,null,"B","LKP- Bumpn' Uglies",2,1,null,11,3]
[12,null,"court 6","E","LKP- Bumpn' Uglies","SARC- Sand Diggers",23,21,"SARC- Sand Diggers",2,null,"B","SARC- Sand Diggers",2,1,null,12,3]
[13,"07:00:00","court 1","F","NR- Hit That Thang","CT- Concrete Feet",21,8,"NR- Hit That Thang",13,null,"B","NR- Hit That Thang",3,0,null,13,3]
{"$rows_left_out":36}
{"sheet":"Night ONE-option 2","index":1,"n_rows":50,"n_cols":14,"rows_kept":50,"cut":false,"hidden":true,"merged":[]}
["Night 1","ALL at Springdale"]
["# games","time","Courts",null,null,null,null,null,null,null,"NO BREAK","30 MIN","60 MIN","90 MIN"]
[1,"06:00:00","court 1","C",9,10,null,null,null,"A",null,1,1]
[2,null,"court 2","C",11,12,null,null,null,"B",null,1,1]
[3,null,"court 3","D",13,14,null,null,null,"C",null,1,1]
[4,null,"court 4","D",15,16,null,null,null,"D",null,1,1]
[5,null,"court 5","E",17,18,null,null,null,"E",null,1,1]
[6,null,"court 6","E",19,20,null,null,null,"F",null,null,1,1]
[7,"06:30:00","court 1","A",1,2,null,null,null,"G",null,1,1]
[8,null,"court 2","A",3,4,null,null,null,"H",null,1,1]
[9,null,"court 3","G",25,26]
[10,null,"court 4","G",27,28]
[11,null,"court 5","F",21,22]
[12,null,"court 6","F",21,23]
[13,"07:00:00","court 1","B",5,6]
{"$rows_left_out":36}
{"sheet":"NIGHT TWO","index":2,"n_rows":83,"n_cols":28,"rows_kept":83,"cut":false,"hidden":false,"merged":[[0,6,0,7],[21,6,21,7],[43,6,43,7],[63,6,63,7]]}
["Lake Park  A VS B Brackets  (A Division)",null,null,null,null,null,"Score",null,null,null,null,null,"RESULTS- After Night Two"]
[null,null,null,null,"HOME","AWAY","W","L","Winner","Pt Diff",null,"Division","Teams","Win","Loss",null,null,null,"Teams on SARC Red Courts",null,"Team","No Break","30 min","60 min",null,null,"ct 1","ct 3"]
[1,"06:00:00","court 1",null,"LKP- Air Vectors","NR- Six Pack Attack",21,14,"NR- Six Pack Attack",{"$f":"G3-H3","v":7},null,"A","SO- Kiss My Ace",{"$f":"COUNTIF('Night ONE'!I$3:I$50,M3)+COUNTIF(I$3:I$83,M3)","v":4},{"$f":"7-N3","v":3},null,null,null,"LKP- Air Vectors",null,1,null,3,null,null,1,2,2]
[2,null,"court 2",null,"SO- Kiss My Ace","LKP- Casual Sets",21,18,"SO- Kiss My Ace",{"$f":"G4-H4","v":3},null,"A","LKP- Air Vectors",{"$f":"COUNTIF('Night ONE'!I$3:I$50,M4)+COUNTIF(I$3:I$83,M4)","v":4},3,null,null,null,"SO- Kiss My Ace",null,2,null,3,null,null,2,2,2]
[3,"06:30:00","court 1",null,"LKP- Pass It Around","GS- 50 Shades of Greystone",21,15,"LKP- Pass It Around",6,null,"A","SARC- Volleywood",{"$f":"COUNTIF('Night ONE'!I$3:I$50,M5)+COUNTIF(I$3:I$83,M5)","v":5},2,null,null,null,"LKP- Pass It Around",null,3,null,3,null,null,3,2,2]
[4,null,"court 2",null,"SARC- Volleywood","LKP- Will Play for Sets",21,12,"SARC- Volleywood",9,null,"A","LKP- Pass It Around",{"$f":"COUNTIF('Night ONE'!I$3:I$50,M6)+COUNTIF(I$3:I$83,M6)","v":2},5,null,null,null,"SARC- Volleywood",null,4,null,3,null,null,4,2,2]
[5,"07:00:00","court 1",null,"LKP- Air Vectors","LKP- Casual Sets",21,17,"LKP- Air Vectors",4,null,"A","LKP- Casual Sets",{"$f":"COUNTIF('Night ONE'!I$3:I$50,M7)+COUNTIF(I$3:I$83,M7)","v":2},5,null,null,null,"NR- Six Pack Attack",null,5,null,2,1,null,5,2,2]
[6,null,"court 2",null,"SO- Kiss My Ace","NR- Six Pack Attack",21,2,"NR- Six Pack Attack",19,null,"A","NR- Six Pack Attack",{"$f":"COUNTIF('Night ONE'!I$3:I$50,M8)+COUNTIF(I$3:I$83,M8)","v":7},0,null,null,null,"LKP- Casual Sets",null,6,null,2,1,null,6,2,2]
[7,"07:30:00","court 1",null,"LKP- Pass It Around","LKP- Will Play for Sets",21,15,"LKP- Will Play for Sets",6,null,"A","LKP- Will Play for Sets",{"$f":"COUNTIF('Night ONE'!I$3:I$50,M9)+COUNTIF(I$3:I$83,M9)","v":4},3,null,null,null,"GS- 50 Shades of Greystone",null,7,1,2,null,null,7,2,2]
[8,null,"court 2",null,"SARC- Volleywood","GS- 50 Shades of Greystone",21,7,"SARC- Volleywood",14,null,"A","GS- 50 Shades of Greystone",{"$f":"COUNTIF('Night ONE'!I$3:I$50,M10)+COUNTIF(I$3:I$83,M10)","v":0},7,null,null,null,"LKP- Will Play for Sets",null,8,1,2,null,null,8,2,2]
[9,"08:00:00","court 1",null,"LKP- Will Play for Sets","SO- Kiss My Ace",21,18,"LKP- Will Play for Sets",3,null,"B","SARC- Raleigh Brawl",{"$f":"COUNTIF('Night ONE'!I$3:I$50,M11)+COUNTIF(I$3:I$83,M11)","v":3},4,null,null,null,null,null,null,null,null,null,null,null,{"$f":"SUM(AA3:AA10)","v":16},{"$f":"SUM(AB3:AB10)","v":16}]
[10,null,"court 2",null,"GS- 50 Shades of Greystone","LKP- Air Vectors",21,19,"LKP- Air Vectors",2,null,"B","SARC- Notorious D.I.G.",{"$f":"COUNTIF('Night ONE'!I$3:I$50,M12)+COUNTIF(I$3:I$83,M12)","v":3},4]
[11,"08:30:00","court 1",null,"LKP- Casual Sets","SARC- Volleywood",21,10,"SARC- Volleywood",11,null,"B","LKP- Bumpn' Uglies",{"$f":"COUNTIF('Night ONE'!I$3:I$50,M13)+COUNTIF(I$3:I$83,M13)","v":4},3]
[12,null,"court 2",null,"NR- Six Pack Attack","LKP- Pass It Around",21,18,"NR- Six Pack Attack",3,null,"B","SARC- Sand Diggers",{"$f":"COUNTIF('Night ONE'!I$3:I$50,M14)+COUNTIF(I$3:I$83,M14)","v":3},4]
[13,"09:00:00","court 1",null,"GS- 50 Shades of Greystone","SO- Kiss My Ace",21,10,"SO- Kiss My Ace",11,null,"B","NR- Hit That Thang",{"$f":"COUNTIF('Night ONE'!I$3:I$50,M15)+COUNTIF(I$3:I$83,M15)","v":6},1]
{"$rows_left_out":69}
{"sheet":"NIGHT THREE","index":3,"n_rows":81,"n_cols":31,"rows_kept":81,"cut":false,"hidden":false,"merged":[[0,6,0,7],[21,6,21,7],[63,6,63,7],[42,6,42,7]]}
["SARC Red-   1st Vertical Bracket Cross-section of Divisions",null,null,null,null,null,"Score",null,null,null,null,null,"RESULTS- After Night Three"]
[null,null,null,null,"HOME","AWAY","W","L","Winner","Pt Diff",null,"Division","Teams","Win","Loss",".","PT DIFF",null,"Teams on SARC Red Courts",null,null,null,null,"Team","No Break","30 min","60 min",null,null,"ct 1","ct 2"]
[1,"06:00:00","court 1",null,"SARC- Raleigh Brawl","SARC- $et for Life",21,13,"SARC- $et for Life",{"$f":"G3-H3","v":8},null,"A","NR- Six Pack Attack",{"$f":"COUNTIF('Night ONE'!I$3:I$50,M3)+COUNTIF('NIGHT TWO'!I$3:I$83,M3)+COUNTIF(I$3:I$81,M3)","v":11},{"$f":"11-N3","v":0},null,105,null,"SARC- Raleigh Brawl",null,null,null,null,1,1,null,2,null,1,2,2]
[2,null,"court 3",null,"SARC- Sets on the Beach","LKP- Air Vectors",21,7,"LKP- Air Vectors",{"$f":"G4-H4","v":14},null,"A","SARC- Volleywood",{"$f":"COUNTIF('Night ONE'!I$3:I$50,M4)+COUNTIF('NIGHT TWO'!I$3:I$83,M4)+COUNTIF(I$3:I$81,M4)","v":8},3,null,64,null,"SARC- Mizfits",null,null,null,null,2,1,1,1,null,2,2,2]
[3,"06:30:00","court 1",null,"SARC- Mizfits","SARC- Dirt Devils",21,5,"SARC- Mizfits",16,null,"A","LKP- Air Vectors",{"$f":"COUNTIF('Night ONE'!I$3:I$50,M5)+COUNTIF('NIGHT TWO'!I$3:I$83,M5)+COUNTIF(I$3:I$81,M5)","v":8},3,null,52,null,"SARC- Notorious D.I.G.",null,null,null,null,9,1,2,null,null,9,2,2]
[4,null,"court 3",null,"SO- Kiss My Ace","SARC- Raleigh Brawl",21,15,"SO- Kiss My Ace",6,null,"A","SO- Kiss My Ace",{"$f":"COUNTIF('Night ONE'!I$3:I$50,M6)+COUNTIF('NIGHT TWO'!I$3:I$83,M6)+COUNTIF(I$3:I$81,M6)","v":8},3,null,28,null,"SARC- Sets on the Beach",null,null,null,null,10,1,1,1,null,10,2,2]
[5,"07:00:00","court 1",null,"LKP- Air Vectors","SARC- Notorious D.I.G.",21,17,"LKP- Air Vectors",4,null,"A","LKP- Will Play for Sets",{"$f":"COUNTIF('Night ONE'!I$3:I$50,M7)+COUNTIF('NIGHT TWO'!I$3:I$83,M7)+COUNTIF(I$3:I$81,M7)","v":7},4,null,17,null,"SARC- $et for Life",null,null,null,null,17,1,1,1,null,17,2,2]
[6,null,"court 3",null,"SARC- $et for Life","SARC- Mizfits",21,18,"SARC- Mizfits",3,null,"A","LKP- Casual Sets",{"$f":"COUNTIF('Night ONE'!I$3:I$50,M8)+COUNTIF('NIGHT TWO'!I$3:I$83,M8)+COUNTIF(I$3:I$81,M8)","v":6},5,null,6,null,"SO- Kiss My Ace",null,null,null,null,18,null,3,null,null,18,2,2]
[7,"07:30:00","court 1",null,"SARC- Dirt Devils","SARC- Sets on the Beach",21,18,"SARC- Dirt Devils",3,null,"A","LKP- Pass It Around",{"$f":"COUNTIF('Night ONE'!I$3:I$50,M9)+COUNTIF('NIGHT TWO'!I$3:I$83,M9)+COUNTIF(I$3:I$81,M9)","v":4},7,null,-11,null,"SARC- Dirt Devils",null,null,null,null,25,1,2,null,null,25,2,2]
[8,null,"court 3",null,"SO- Kiss My Ace","SARC- $et for Life",21,15,"SO- Kiss My Ace",6,null,"A","GS- 50 Shades of Greystone",{"$f":"COUNTIF('Night ONE'!I$3:I$50,M10)+COUNTIF('NIGHT TWO'!I$3:I$83,M10)+COUNTIF(I$3:I$81,M10)","v":2},9,null,-57,null,"LKP- Air Vectors",null,null,null,null,26,null,3,null,null,26,2,2]
[9,"08:00:00","court 1",null,"SARC- Raleigh Brawl","LKP- Air Vectors",21,7,"LKP- Air Vectors",14,null,"B","CT- Concrete Feet",{"$f":"COUNTIF('Night ONE'!I$3:I$50,M11)+COUNTIF('NIGHT TWO'!I$3:I$83,M11)+COUNTIF(I$3:I$81,M11)","v":10},1,null,85,null,null,null,null,null,null,null,null,null,null,null,null,{"$f":"SUM(AD3:AD10)","v":16},{"$f":"SUM(AE3:AE10)","v":16}]
[10,null,"court 3",null,"SARC- Notorious D.I.G.","SARC- Sets on the Beach",21,8,"SARC- Notorious D.I.G.",13,null,"B","LKP- Bumpn' Uglies",{"$f":"COUNTIF('Night ONE'!I$3:I$50,M12)+COUNTIF('NIGHT TWO'!I$3:I$83,M12)+COUNTIF(I$3:I$81,M12)","v":7},4,null,62]
[11,"08:30:00","court 1",null,"SARC- Mizfits","SO- Kiss My Ace",21,5,"SO- Kiss My Ace",16,null,"B","SARC- Sand Diggers",{"$f":"COUNTIF('Night ONE'!I$3:I$50,M13)+COUNTIF('NIGHT TWO'!I$3:I$83,M13)+COUNTIF(I$3:I$81,M13)","v":7},4,null,34]
[12,null,"court 3",null,"SARC- Notorious D.I.G.","SARC- Dirt Devils",21,19,"SARC- Notorious D.I.G.",2,null,"B","NR- Hit That Thang",{"$f":"COUNTIF('Night ONE'!I$3:I$50,M14)+COUNTIF('NIGHT TWO'!I$3:I$83,M14)+COUNTIF(I$3:I$81,M14)","v":7},4,null,12]
[13,"09:00:00","court 1",null,"SARC- $et for Life","SARC- Sets on the Beach",21,15,"SARC- $et for Life",6,null,"B","SARC- Notorious D.I.G.",{"$f":"COUNTIF('Night ONE'!I$3:I$50,M15)+COUNTIF('NIGHT TWO'!I$3:I$83,M15)+COUNTIF(I$3:I$81,M15)","v":5},6,null,3]
{"$rows_left_out":67}
{"sheet":"Championship Night","index":4,"n_rows":69,"n_cols":21,"rows_kept":69,"cut":false,"hidden":false,"merged":[[4,15,7,15]]}
[null,"Growler Championship Night- 32 Team Single Elimination",null,null,null,null,null,null,null,null,null,null,null,null,null,"Raffle","Final 4",null,"Championship"]
[]
[]
[null,"17:30:00",null,"18:00:00",null,"18:30:00",null,"19:00:00",null,"19:30:00",null,"20:00:00",null,"20:30:00",null,"21:00:00","21:30:00",null,"22:00:00"]
[null,null,null,null,null,null,null,null,null,null,null,null,null,null,null,"Break for Announce-ments and Raffle"]
[null,null,null,null,1,"SARC- Volleywood"]
[null,null,null,null,null,1,null,null,null,"SARC- Volleywood"]
[null,null,null,null,32,"SARC- Mojo Risin "]
[null,null,null,null,null,"court 1",null,null,null,17,null,null,null,"SARC- Volleywood"]
[16,"SARC- I'd Hit That"]
[null,2]
[17,"SARC- Raleigh Brawl",null,null,null,null,null,null,null,"court 1"]
[null,"court 4",null,null,null,null,null,null,null,null,null,null,null,25,null,null,"SARC- Volleywood"]
[null,null,null,null,null,null,8,"GS- Sand Gators"]
[null,null,null,null,null,null,null,3,null,null,null,"GS- Sand Gators"]
{"$rows_left_out":55}
{"sheet":"Team SB Donations","index":5,"n_rows":39,"n_cols":11,"rows_kept":39,"cut":false,"hidden":false,"merged":[]}
[null,"St Baldrick's Download Team Report",null,null,"2015-08-18"]
[]
[]
["Growler Team Rank","CLUB","Team Name","# of Participants","Team Captain Full Name","Team Captain Display Name","Team Fundraising Goal","Amount Raised","Sponsorships earned","Sponsors acquired or other SB credits","Total"]
[1,"SARC","Sand Diggers",3,"John M Marks","John Marks",750,5452,500,"Rabon and Dailey, Sports and More",{"$f":"SUM(H5:I5)","v":5952}]
[2,"SARC","The Zack Attack Pack",4,"Bill  Green","Bill Green",500,2775,null,null,2775]
[3,"SO","Kiss My Ace!",5,"Olaf  Schroeder","Olaf Schroeder",300,2555,null,null,2555]
[4,"SARC","Volleywood",7,"Robert  Rauth","Robert R.",1000,2345,null,null,2345]
[5,"GS","Sand Gators",1,"Greystone  Sand Gators","Greystone Sand Gators",500,770,1500,"Triangle Orthopedic, NC Spec. Hospital",2270]
[6,"SARC","Springdale Mizfits",8,"Jay W Cupstid","Jay Cupstid",2000,1723,300,"BTM Landscape",2023]
[7,"SARC","$et For Life",11,"Dan  Schaefer","Dan Schaefer",1700,1490,450,"Lexus, Sharky's",1940]
[8,"LPK","LKP- Pass it Around",2,"Gregg  Klofenstine","Gregg Klofenstine",1500,1645,null,null,1645]
[9,"SARC","You've Been Served",1,"Ryan D Oxendine","Ryan Oxendine",300,0,1500,"Oxendine- Price attorneys",1500]
[10,"SO","Team Kona",2,"J  maierhofer","J maierhofer",5000,1437,null,null,1437]
[11,"CT","Dangerous When Set",6,"Thomas M Beaulieu","Thomas Beaulieu",500,1185,175,"CT - Shave Santa",1360]
{"$rows_left_out":25}
{"sheet":"GPI Ranking-Seeding","index":6,"n_rows":36,"n_cols":25,"rows_kept":36,"cut":false,"hidden":false,"merged":[[0,4,0,6],[0,2,0,3],[0,7,0,9],[0,10,0,11],[1,7,1,8]]}
[null,null,"#1- Strength of Schedule",null,"#2- NUMBER OF WINS",null,null,"#3- POINT DIFFERENTIAL",null,null,"#4- MONEY FOR ST BALDRICKS",null,null,null,null,null,null,"Point Differential"]
[null,"Method for Determining Points >>>>>>>>>>>>>>>","Points","A= 8 pts,      B=5 pts,       C= 2 pts,      D= 0 pts",null,"Points","= # of Wins","Ranking",null,"=(32-Rank)/7","Ranking","=(32-Rank)/5","Total Pts from Wins, Pt Diff, Tier Diff, Money raised",null,null,null,null,"Rank","Division","Teams","Win","Loss","Head to Head","PT DIFF"]
[null,"Point Variance",null,8,null,null,11,null,null,4.4000000000000004,null,6,null,null,null,null,null,1,"A","NR- Six Pack Attack",null,null,null,105,1]
["Ranking","Teams","Team Level","Points for Tier Difficulty","Win","Loss","Points from W/L","POINT DIFFERENTIAL","Pt Diff Rank","Points from Pt Diff ","Rank- Money Raised for St Baldricks or Sponsorship","POINTS for Money Raised for St Baldricks or Sponsorship","TOTAL POINTS",null,null,null,null,2,"B","CT- Concrete Feet",null,null,null,85,2]
[1,"SARC- Volleywood","A",{"$f":"IF(C5=\"A\",8,IF(C5=\"B\",5,IF(C5=\"C\",2,0)))","v":8},{"$f":"VLOOKUP(B5,'NIGHT THREE'!M$3:N$34,2,FALSE)","v":8},{"$f":"VLOOKUP(B5,'NIGHT THREE'!M$3:O$34,3,FALSE)","v":3},{"$f":"E5","v":8},64,5,{"$f":"(32-I5)/7","v":3.8571428571428572},5,{"$f":"(32-K5)/5","v":5.4},{"$f":"G5+J5+D5+L5","v":25.25714285714286},null,null,null,null,3,"D","CT- Dangerous When Set",null,null,null,74,3]
[2,"SO- Kiss My Ace","A",8,{"$f":"VLOOKUP(B6,'NIGHT THREE'!M$3:N$34,2,FALSE)","v":8},{"$f":"VLOOKUP(B6,'NIGHT THREE'!M$3:O$34,3,FALSE)","v":3},8,28,10,3.1428571428571428,3,5.8,24.942857142857143,null,null,null,null,4,"C","SARC- $et for Life",null,null,null,67,4]
[3,"NR- Six Pack Attack","A",8,{"$f":"VLOOKUP(B7,'NIGHT THREE'!M$3:N$34,2,FALSE)","v":11},{"$f":"VLOOKUP(B7,'NIGHT THREE'!M$3:O$34,3,FALSE)","v":0},11,105,1,4.4285714285714288,27,1,24.428571428571431,null,null,null,null,5,"A","SARC- Volleywood",null,null,null,64,5]
[4,"LKP- Air Vectors","A",8,{"$f":"VLOOKUP(B8,'NIGHT THREE'!M$3:N$34,2,FALSE)","v":8},{"$f":"VLOOKUP(B8,'NIGHT THREE'!M$3:O$34,3,FALSE)","v":3},8,52,7,3.5714285714285716,20,2.4,21.971428571428568,null,null,null,null,6,"B","LKP- Bumpn' Uglies",null,null,null,62,6]
[5,"SARC- Sand Diggers","B",5,{"$f":"VLOOKUP(B9,'NIGHT THREE'!M$3:N$34,2,FALSE)","v":7},{"$f":"VLOOKUP(B9,'NIGHT THREE'!M$3:O$34,3,FALSE)","v":4},7,34,9,3.2857142857142856,1,6.2,21.485714285714284,null,null,null,null,7,"A","LKP- Air Vectors",null,null,null,52,7]
[6,"CT- Concrete Feet","B",5,{"$f":"VLOOKUP(B10,'NIGHT THREE'!M$3:N$34,2,FALSE)","v":10},{"$f":"VLOOKUP(B10,'NIGHT THREE'!M$3:O$34,3,FALSE)","v":1},10,85,2,4.2857142857142856,26,1.2,20.485714285714284,null,null,null,null,8,"C","GS- Sand Gators",null,null,null,43,8]
[7,"SARC- $et for Life","C",2,{"$f":"VLOOKUP(B11,'NIGHT THREE'!M$3:N$34,2,FALSE)","v":9},{"$f":"VLOOKUP(B11,'NIGHT THREE'!M$3:O$34,3,FALSE)","v":2},9,67,4,4,6,5.2,20.2,null,null,null,null,9,"B","SARC- Sand Diggers",null,null,null,34,9]
[8,"GS- Sand Gators","C",2,{"$f":"VLOOKUP(B12,'NIGHT THREE'!M$3:N$34,2,FALSE)","v":8},{"$f":"VLOOKUP(B12,'NIGHT THREE'!M$3:O$34,3,FALSE)","v":3},8,43,8,3.4285714285714284,4,5.6,19.028571428571428,null,null,null,null,10,"A","SO- Kiss My Ace",null,null,null,28,10]
[9,"LKP- Will Play for Sets","A",8,{"$f":"VLOOKUP(B13,'NIGHT THREE'!M$3:N$34,2,FALSE)","v":7},{"$f":"VLOOKUP(B13,'NIGHT THREE'!M$3:O$34,3,FALSE)","v":4},7,17,11,3,28,0.8,18.8,null,null,null,null,11,"A","LKP- Will Play for Sets",null,null,null,27,11]
[10,"LKP- Pass It Around","A",8,{"$f":"VLOOKUP(B14,'NIGHT THREE'!M$3:N$34,2,FALSE)","v":4},{"$f":"VLOOKUP(B14,'NIGHT THREE'!M$3:O$34,3,FALSE)","v":7},4,-11,19,1.8571428571428572,8,4.8,18.657142857142858,null,null,null,null,12,"D","GS- El Toro's Revenge",null,null,null,19,12]
[11,"LKP- Bumpn' Uglies","B",5,{"$f":"VLOOKUP(B15,'NIGHT THREE'!M$3:N$34,2,FALSE)","v":7},{"$f":"VLOOKUP(B15,'NIGHT THREE'!M$3:O$34,3,FALSE)","v":4},7,62,6,3.7142857142857144,18,2.8,18.514285714285716,null,null,null,null,13,"B","NR- Hit That Thang",null,null,null,12,13]
{"$rows_left_out":22}
{"sheet":"Teams","index":7,"n_rows":49,"n_cols":21,"rows_kept":49,"cut":false,"hidden":false,"merged":[]}
[]
[]
[]
[]
[]
[]
[]
[]
[]
[]
[]
[]
[]
[]
[]
{"$rows_left_out":35}
{"sheet":"32 team Bracketology","index":8,"n_rows":39,"n_cols":13,"rows_kept":39,"cut":false,"hidden":false,"merged":[]}
["32 TEAM BRACKETOLOGY-  The method to this schedule Madness"]
[]
["Night 1","All at SARC- Play Within Your Bracket"]
[null,"Teams play a round robin with 3 teams in their same Bracket"]
[null," 8 Brackets of 4- 3 games each  "]
[]
["A",1,2,3,4,"B",5,6,7,8,null,"Best 8 Teams in Row 1- \"A\" Teams"]
[null,null,null,null,null,null,null,null,null,null,null,"Team #s 1,3,5 and 7 will be the best 4 teams"]
["C",9,10,11,12,"D",13,14,15,16]
[]
["E",17,18,19,20,"F",21,22,23,24]
[]
["G",25,26,27,28,"H",29,30,31,32]
[]
[]
{"$rows_left_out":25}
{"sheet":"# of games per night","index":9,"n_rows":50,"n_cols":18,"rows_kept":50,"cut":false,"hidden":false,"merged":[]}
["Night 1","ALL at Springdale",null,null,null,null,null,null,null,null,"Nights 2 and 3",null,"  - 3 HOST CLUBS (SARC, LKP, and GS)"]
["# games","time","Courts",null,null,null,null,null,null,null,null,null,"8 courts at 4 Sites w/ SARC counting as 2 Sites"]
[1,"06:00:00","court 1",null,"32 teams",null,null,null,null,null,null,null,null,"SARC Red and SARC Bluelue to be one perm court and one temp sand court"]
[2,null,"court 2",null,"3 games each",null,null,null,null,null,1,6,"court 1"]
[3,null,"court 3",null,"(32*3)/2",null,null,null,null,null,2,null,"court 2",null,"SARC Red","SARC Blue","LPK","GS"]
[4,null,"court 4",null,{"$f":"(32*3)/2","v":48},null,null,"# of games",null,null,3,"06:30:00","court 1",null,"2 courts","2 courts","2 courts","2 courts"]
[5,null,"court 5",null,null,null,null,null,null,null,4,null,"court 2",null,"8 teams","8 teams","8 teams","8 teams"]
[6,null,"court 6",null,null,null,null,null,null,null,5,7,"court 1"]
[7,"06:30:00","court 1",null,"4 total Sand courts at SARC w/ 2 temp Sand",null,null,null,null,null,6,null,"court 2",null,"Each Site- 8 teams"]
[8,null,"court 2",null,"Courts 3 and 4 are temporary sand courts on the soccer field",null,null,null,null,null,7,"07:30:00","court 1",null,"4 games each",null,"# of Games"]
[9,null,"court 3",null,"12 games on grass (courts 5 and 6)- no lights",null,null,null,null,null,8,null,"court 2",null,"(8*4)/2",null,"games per Site"]
[10,null,"court 4",null,"24 teams to play on grass",null,null,null,null,null,9,8,"court 1",null,{"$f":"(8*4)/2","v":16}]
[11,null,"court 5",null,"Best 8 teams only play sand",null,null,null,null,null,10,null,"court 2",null,"Occuring at 4 Sites"]
[12,null,"court 6",null,null,null,null,null,null,null,11,"08:30:00","court 1"]
[13,"07:00:00","court 1",null,"Games scheduled b/t 6 - 10:30 PM",null,null,null,null,null,12,null,"court 2",null,"Games scheduled b/t 6 PM - 10"]
{"$rows_left_out":36}
{"sheet":"Team # Match ups","index":10,"n_rows":51,"n_cols":33,"rows_kept":51,"cut":false,"hidden":false,"merged":[]}
["Night 1",null,null,null,null,null,null,null,null,null,null,null,"Night 2",null,null,null,null,null,null,null,null,null,null,null,"Night 3"]
[]
["# games","Bracket","Team  VS","Team",null,null,null,null,null,null,null,null,"# games","Bracket","Team  VS","Team",null,null,"# games","Bracket","Team  VS","Team",null,null,"# games","Bracket","Team  VS","Team",null,"# games","Bracket","Team  VS","Team"]
[1,"A",1,2,null,null,null,null,null,null,null,null,1,"SARC Red",1,5,null,null,1,"SARC Blue",17,21,null,null,1,"SARC Red",1,9,null,1,"LPK",5,13]
[2,"A",1,3,null,null,null,null,null,null,null,null,2,"SARC Red",1,6,null,null,2,"SARC Blue",17,22,null,null,2,"SARC Red",1,17,null,2,"LPK",5,21]
[3,"A",4,1,null,null,null,null,null,null,null,null,3,"SARC Red",7,1,null,null,3,"SARC Blue",23,17,null,null,3,"SARC Red",25,1,null,3,"LPK",29,5]
[4,"A",2,3,null,null,null,null,null,null,null,null,4,"SARC Red",8,1,null,null,4,"SARC Blue",24,17,null,null,4,"SARC Red",17,9,null,4,"LPK",21,13]
[5,"A",2,4,null,null,null,null,null,null,null,null,5,"SARC Red",2,5,null,null,5,"SARC Blue",18,21,null,null,5,"SARC Red",9,25,null,5,"LPK",13,29]
[6,"A",3,4,null,null,null,null,null,null,null,null,6,"SARC Red",2,6,null,null,6,"SARC Blue",18,22,null,null,6,"SARC Red",17,25,null,6,"LPK",21,29]
[7,"B",5,6,null,null,null,null,null,null,null,null,7,"SARC Red",7,2,null,null,7,"SARC Blue",23,18,null,null,7,"SARC Red",10,1,null,7,"LPK",14,5]
[8,"B",5,7,null,null,null,null,null,null,null,null,8,"SARC Red",8,2,null,null,8,"SARC Blue",24,18,null,null,8,"SARC Red",9,18,null,8,"LPK",13,22]
[9,"B",8,5,null,null,null,null,null,null,null,null,9,"SARC Red",5,3,null,null,9,"SARC Blue",21,19,null,null,9,"SARC Red",26,17,null,9,"LPK",30,21]
[10,"B",6,7,null,null,null,null,null,null,null,null,10,"SARC Red",6,3,null,null,10,"SARC Blue",22,19,null,null,10,"SARC Red",25,2,null,10,"LPK",29,6]
[11,"B",6,8,null,null,null,null,null,null,null,null,11,"SARC Red",3,7,null,null,11,"SARC Blue",19,23,null,null,11,"SARC Red",2,10,null,11,"LPK",6,14]
[12,"B",7,8,null,null,null,null,null,null,null,null,12,"SARC Red",3,8,null,null,12,"SARC Blue",19,24,null,null,12,"SARC Red",2,18,null,12,"LPK",6,22]
{"$rows_left_out":36}