{"text_format":"1","workbook":"xlsx","n_sheets":11,"sheets":["Night ONE","Night ONE-option 2","NIGHT TWO","NIGHT THREE","Championship Night","GPI Ranking-Seeding","Team SB Donations","Teams","32 team Bracketology","# of games per night","Team # Match ups"],"not_rendered":{"charts":0,"images":0,"macros":1,"external_links":0,"defined_names":3,"comments":0,"pivot_tables":0},"unopened":[],"bounds":{"document_bytes":16777216,"sheet_cells":100000,"rows_first":2000,"rows_last":500,"rows_between":2000,"halvings":0,"cell_chars":16384,"cell_head_chars":4096},"cells_cut":0,"cells_raw":0,"read":"whole","date_system":"1900"}

{"sheet":"Night ONE","index":0,"n_rows":50,"n_cols":24,"rows_kept":50,"cut":false,"hidden":false,"merged":[[0,6,0,7]]}
["Night 1- ALL at Springdale",null,null,null,"  - Teams Play each team within their own Bracket",null,"Score",null,null,null,null,null,"RESULTS- Night One"]
["# games","time","Courts","Bracket","HOME","AWAY","W","L","Winner","Pt Diff",null,"Division","Teams","Win","Loss",null,"Team #","# of Games",null,"Bracket","NO BREAK","30 MIN","60 MIN","90 MIN"]
[1,"06:00:00","court 1","C1","SARC- Good Bumps, Nice Sets","SO- Team Kona",21,11,"SARC- Good Bumps, Nice Sets",{"$f":"G3-H3","v":10},null,"A","LKP- Air Vectors",{"$f":"COUNTIF(I$3:I$50,M3)","v":3},{"$f":"3-N3","v":0},null,1,3,null,"A",null,null,2]
[2,null,"court 2","C1","CT- Volley Llamas","CT- Concrete Feet",21,15,"CT- Concrete Feet",{"$f":"G4-H4","v":6},null,"A","SARC- $et for Life",{"$f":"COUNTIF(I$3:I$50,M4)","v":0},3,null,2,3,null,"B",null,1,1]
[3,null,"court 3","C2","LKP- Block You Like a Hurricane","HG- Swingrays",21,16,"LKP- Block You Like a Hurricane",5,null,"A","CT- Spikological Warfare",2,1,null,3,3,null,"C",null,1,1]
[4,null,"court 4","C2","GS- Sand Gators","GS- Setsual Healing",24,22,"GS- Setsual Healing",2,null,"A","SARC- Volleywood",1,2,null,4,3,null,"D",null,2]
[5,null,"court 5","B2","LKP- Casual Sets","LKP- Bumpn' Uglies",21,3,"LKP- Bumpn' Uglies",18,null,"A","LKP- Pass It Around",1,2,null,5,3,null,"E",null,1,1]
[6,null,"court 6","B2","NR- Hit That Thang","GS- 50 Shades of Greystone",21,18,"GS- 50 Shades of Greystone",3,null,"A","LKP- Will Play for Sets",1,2,null,6,3,null,"F",null,2]
[7,"06:30:00","court 1","A1","LKP- Air Vectors","SARC- $et for Life",21,13,"LKP- Air Vectors",8,null,"A","NR- Six Pack Attack",2,1,null,7,3,null,"G",null,null,2]
[8,null,"court 2","A1","CT- Spikological Warfare","SARC- Volleywood",21,11,"CT- Spikological Warfare",10,null,"A","SO- Kiss My Ace",2,1,null,8,3,null,"H",null,1,1]
{"$rows_left_out":41}
{"sheet":"Night ONE-option 2","index":1,"n_rows":50,"n_cols":14,"rows_kept":50,"cut":false,"hidden":true,"merged":[]}
["Night 1","ALL at Springdale"]
["# games","time","Courts",null,null,null,null,null,null,null,"NO BREAK","30 MIN","60 MIN","90 MIN"]
[1,"06:00:00","court 1","C",9,10,null,null,null,"A",null,1,1]
[2,null,"court 2","C",11,12,null,null,null,"B",null,1,1]
[3,null,"court 3","D",13,14,null,null,null,"C",null,1,1]
[4,null,"court 4","D",15,16,null,null,null,"D",null,1,1]
[5,null,"court 5","E",17,18,null,null,null,"E",null,1,1]
[6,null,"court 6","E",19,20,null,null,null,"F",null,null,1,1]
[7,"06:30:00","court 1","A",1,2,null,null,null,"G",null,1,1]
[8,null,"court 2","A",3,4,null,null,null,"H",null,1,1]
{"$rows_left_out":41}
{"sheet":"NIGHT TWO","index":2,"n_rows":143,"n_cols":28,"rows_kept":143,"cut":false,"hidden":false,"merged":[[0,6,0,7],[43,6,43,7],[21,6,21,7],[63,6,63,7]]}
["Lake Park  A1 VS A2 Brackets  (A Division)",null,null,null,null,null,"Score",null,null,null,null,null,"RESULTS- After Night Two"]
[null,null,null,"Division","HOME","AWAY","W","L","Winner","Pt Diff",null,"Division","Teams","Win","Loss",null,null,null,"Teams on Lake Park",null,"Team","No Break","30 min","60 min",null,null,"ct 1","ct 3"]
[1,"06:00:00","court 1","A","SARC- $et for Life","LKP- Will Play for Sets",21,17,"LKP- Will Play for Sets",{"$f":"G3-H3","v":4},null,"A","LKP- Air Vectors",{"$f":"COUNTIF('Night ONE'!I$3:I$50,M3)+COUNTIF(I$3:I$85,M3)","v":4},{"$f":"7-N3","v":3},null,null,null,"SARC- $et for Life",null,1,null,3,null,null,1,2,2]
[2,null,"court 2","A","LKP- Air Vectors","LKP- Pass It Around",21,10,"LKP- Pass It Around",{"$f":"G4-H4","v":11},null,"A","SARC- $et for Life",{"$f":"COUNTIF('Night ONE'!I$3:I$50,M4)+COUNTIF(I$3:I$85,M4)","v":1},6,null,null,null,"LKP- Air Vectors",null,2,null,3,null,null,2,2,2]
[3,"06:30:00","court 1","A","SARC- Volleywood","SO- Kiss My Ace",21,13,"SARC- Volleywood",8,null,"A","CT- Spikological Warfare",{"$f":"COUNTIF('Night ONE'!I$3:I$50,M5)+COUNTIF(I$3:I$85,M5)","v":4},3,null,null,null,"SARC- Volleywood",null,3,null,3,null,null,3,2,2]
[4,null,"court 2","A","CT- Spikological Warfare","NR- Six Pack Attack",21,18,"CT- Spikological Warfare",3,null,"A","SARC- Volleywood",{"$f":"COUNTIF('Night ONE'!I$3:I$50,M6)+COUNTIF(I$3:I$85,M6)","v":3},4,null,null,null,"CT- Spikological Warfare",null,4,null,3,null,null,4,2,2]
[5,"07:00:00","court 1","A","SARC- $et for Life","LKP- Pass It Around",21,15,"LKP- Pass It Around",6,null,"A","LKP- Pass It Around",{"$f":"COUNTIF('Night ONE'!I$3:I$50,M7)+COUNTIF(I$3:I$85,M7)","v":4},3,null,null,null,"LKP- Will Play for Sets",null,5,null,2,1,null,5,2,2]
[6,null,"court 2","A","LKP- Air Vectors","LKP- Will Play for Sets",21,7,"LKP- Will Play for Sets",14,null,"A","LKP- Will Play for Sets",{"$f":"COUNTIF('Night ONE'!I$3:I$50,M8)+COUNTIF(I$3:I$85,M8)","v":5},2,null,null,null,"LKP- Pass It Around",null,6,null,2,1,null,6,2,2]
[7,"07:30:00","court 1","A","SARC- Volleywood","NR- Six Pack Attack",21,14,"SARC- Volleywood",7,null,"A","NR- Six Pack Attack",{"$f":"COUNTIF('Night ONE'!I$3:I$50,M9)+COUNTIF(I$3:I$85,M9)","v":3},4,null,null,null,"SO- Kiss My Ace",null,7,1,2,null,null,7,2,2]
[8,null,"court 2","A","CT- Spikological Warfare","SO- Kiss My Ace",21,18,"SO- Kiss My Ace",3,null,"A","SO- Kiss My Ace",{"$f":"COUNTIF('Night ONE'!I$3:I$50,M10)+COUNTIF(I$3:I$85,M10)","v":4},3,null,null,null,"NR- Six Pack Attack",null,8,1,2,null,null,8,2,2]
{"$rows_left_out":134}
{"sheet":"NIGHT THREE","index":3,"n_rows":81,"n_cols":31,"rows_kept":81,"cut":false,"hidden":false,"merged":[[0,6,0,7],[21,6,21,7],[63,6,63,7],[42,6,42,7]]}
["SARC Red-   1st Vertical Bracket Cross-section of Divisions",null,null,null,null,null,"Score",null,null,null,null,null,"RESULTS- After Night Three"]
[null,null,null,null,"HOME","AWAY","W","L","Winner","Pt Diff",null,"Division","Teams","Win","Loss",".","PT DIFF",null,"Teams on SARC Red Courts",null,null,null,null,"Team","No Break","30 min","60 min",null,null,"ct 1","ct 2"]
[1,"06:00:00","court 1",null,"SARC- Raleigh Brawl","SARC- Good Bumps, Nice Sets",21,15,"SARC- Raleigh Brawl",{"$f":"G3-H3","v":6},null,"A","LKP- Air Vectors",{"$f":"COUNTIF('Night ONE'!I$3:I$50,M3)+COUNTIF('NIGHT TWO'!I$3:I$85,M3)+COUNTIF(I$3:I$81,M3)","v":7},{"$f":"11-N3","v":4},null,7,null,"SARC- Raleigh Brawl",null,null,null,null,1,1,null,2,null,1,2,2]
[2,null,"court 3",null,"SARC- Mizfits","SARC- $et for Life",21,1,"SARC- $et for Life",{"$f":"G4-H4","v":20},null,"A","SARC- $et for Life",{"$f":"COUNTIF('Night ONE'!I$3:I$50,M4)+COUNTIF('NIGHT TWO'!I$3:I$85,M4)+COUNTIF(I$3:I$81,M4)","v":5},6,null,27,null,"SARC- Unprotected Sets",null,null,null,null,2,1,1,1,null,2,2,2]
[3,"06:30:00","court 1",null,"SARC- Unprotected Sets","SO- Team Kona",21,15,"SARC- Unprotected Sets",6,null,"A","CT- Spikological Warfare",{"$f":"COUNTIF('Night ONE'!I$3:I$50,M5)+COUNTIF('NIGHT TWO'!I$3:I$85,M5)+COUNTIF(I$3:I$81,M5)","v":8},3,null,52,null,"SARC- Sand Diggers",null,null,null,null,9,1,2,null,null,9,2,2]
[4,null,"court 3",null,"LKP- Air Vectors","SARC- Raleigh Brawl",21,17,"LKP- Air Vectors",4,null,"A","SARC- Volleywood",{"$f":"COUNTIF('Night ONE'!I$3:I$50,M6)+COUNTIF('NIGHT TWO'!I$3:I$85,M6)+COUNTIF(I$3:I$81,M6)","v":7},4,null,33,null,"SARC- Mizfits",null,null,null,null,10,1,1,1,null,10,2,2]
[5,"07:00:00","court 1",null,"SARC- $et for Life","SARC- Sand Diggers",21,16,"SARC- $et for Life",5,null,"A","LKP- Pass It Around",{"$f":"COUNTIF('Night ONE'!I$3:I$50,M7)+COUNTIF('NIGHT TWO'!I$3:I$85,M7)+COUNTIF(I$3:I$81,M7)","v":8},3,null,53,null,"SARC- Good Bumps, Nice Sets",null,null,null,null,17,1,1,1,null,17,2,2]
[6,null,"court 3",null,"SARC- Good Bumps, Nice Sets","SARC- Unprotected Sets",23,21,"SARC- Good Bumps, Nice Sets",2,null,"A","LKP- Will Play for Sets",{"$f":"COUNTIF('Night ONE'!I$3:I$50,M8)+COUNTIF('NIGHT TWO'!I$3:I$85,M8)+COUNTIF(I$3:I$81,M8)","v":9},2,null,71,null,"LKP- Air Vectors",null,null,null,null,18,null,3,null,null,18,2,2]
[7,"07:30:00","court 1",null,"SO- Team Kona","SARC- Mizfits",21,14,"SO- Team Kona",7,null,"A","NR- Six Pack Attack",{"$f":"COUNTIF('Night ONE'!I$3:I$50,M9)+COUNTIF('NIGHT TWO'!I$3:I$85,M9)+COUNTIF(I$3:I$81,M9)","v":7},{"$f":"11-N9","v":4},null,45,null,"SO- Team Kona",null,null,null,null,25,1,2,null,null,25,2,2]
[8,null,"court 3",null,"LKP- Air Vectors","SARC- Good Bumps, Nice Sets",21,12,"LKP- Air Vectors",9,null,"A","SO- Kiss My Ace",{"$f":"COUNTIF('Night ONE'!I$3:I$50,M10)+COUNTIF('NIGHT TWO'!I$3:I$85,M10)+COUNTIF(I$3:I$81,M10)","v":7},4,null,16,null,"SARC- $et for Life",null,null,null,null,26,null,3,null,null,26,2,2]
{"$rows_left_out":72}
{"sheet":"Championship Night","index":4,"n_rows":69,"n_cols":21,"rows_kept":69,"cut":false,"hidden":false,"merged":[[4,15,7,15]]}
[null,"Growler Championship Night- 32 Team Single Elimination",null,null,null,null,null,null,null,"FINAL Seeding",null,null,null,null,null,"Raffle","Final 4",null,"Championship"]
[]
[]
[null,"17:30:00",null,"18:00:00",null,"18:30:00",null,"19:00:00",null,"19:30:00",null,"20:00:00",null,"20:30:00",null,"21:00:00","21:30:00",null,"22:00:00"]
[null,null,null,null,null,null,null,null,null,null,null,null,null,null,null,"Break for Announce-ments and Raffle"]
[null,null,null,null,1,"SARC- Volleywood"]
[null,null,null,null,null,1,null,null,null,"SARC- Volleywood"]
[null,null,null,null,32,"SARC- Mojo Risin "]
[null,null,null,null,null,"court 1",null,null,null,17,null,null,null,"SARC- Volleywood"]
[16,"SARC- Raleigh Brawl"]
{"$rows_left_out":60}
{"sheet":"GPI Ranking-Seeding","index":5,"n_rows":36,"n_cols":25,"rows_kept":36,"cut":false,"hidden":false,"merged":[[0,4,0,6],[0,2,0,3],[0,7,0,9],[0,10,0,11],[1,7,1,8]]}
[2016,"FINAL SEEDING ","#1- Strength of Schedule",null,"#2- NUMBER OF WINS",null,null,"#3- POINT DIFFERENTIAL",null,null,"#4- MONEY FOR ST BALDRICKS",null,null,null,null,null,null,"Point Differential"]
[{"$f":"'Team SB Donations'!E1","v":"8/21/16  7am"},"Method for Determining Points >>>>>>>>>>>>>>>","Points","A= 8 pts,      B=5 pts,       C= 2 pts,      D= 0 pts",null,"Points","= # of Wins","Ranking",null,"=(32-Rank)/7","Ranking","=(32-Rank)/5","Total Pts from Wins, Pt Diff, Tier Diff, Money raised",null,null,null,null,null,"Division","Teams","Win","Loss",".","PT DIFF","Rank"]
[null,"Point Variance",null,8,null,null,11,null,null,4.4000000000000004,null,6,null,null,null,null,null,null,"C","GS- Setsual Healing",10,1,null,107,1]
["Ranking","Teams","Team Level","Points for Tier Difficulty","Win","Loss","Points from W/L","POINT DIFFERENTIAL","Pt Diff Rank","Points from Pt Diff ","Rank- Money Raised for St Baldricks or Sponsorship","POINTS for Money Raised for St Baldricks or Sponsorship","TOTAL POINTS",null,null,null,null,null,"B","LKP- Bumpn' Uglies",9,2,null,87,2]
[1,"SARC- Volleywood","A",{"$f":"IF(C5=\"A\",8,IF(C5=\"B\",5,IF(C5=\"C\",2,0)))","v":8},{"$f":"VLOOKUP(B5,'NIGHT THREE'!M$3:N$34,2,FALSE)","v":7},{"$f":"VLOOKUP(B5,'NIGHT THREE'!M$3:O$34,3,FALSE)","v":4},{"$f":"E5","v":7},{"$f":"VLOOKUP(B5,T$3:Y$34,5,FALSE)","v":33},{"$f":"VLOOKUP($B5,T$3:Y$34,6,FALSE)","v":11},{"$f":"(32-I5)/7","v":3},{"$f":"VLOOKUP($B5,'Team SB Donations'!B$5:L$36,11,FALSE)","v":2},{"$f":"(32-K5)/5","v":6},{"$f":"G5+J5+D5+L5","v":24},null,null,null,null,null,"A","LKP- Will Play for Sets",9,2,null,71,3]
[2,"SARC- Sand Diggers","B",{"$f":"IF(C6=\"A\",8,IF(C6=\"B\",5,IF(C6=\"C\",2,0)))","v":5},{"$f":"VLOOKUP(B6,'NIGHT THREE'!M$3:N$34,2,FALSE)","v":7},{"$f":"VLOOKUP(B6,'NIGHT THREE'!M$3:O$34,3,FALSE)","v":4},{"$f":"E6","v":7},{"$f":"VLOOKUP(B6,T$3:Y$34,5,FALSE)","v":49},{"$f":"VLOOKUP($B6,T$3:Y$34,6,FALSE)","v":8},{"$f":"(32-I6)/7","v":3.4285714285714284},{"$f":"VLOOKUP($B6,'Team SB Donations'!B$5:L$36,11,FALSE)","v":1},{"$f":"(32-K6)/5","v":6.2},{"$f":"G6+J6+D6+L6","v":21.62857142857143},null,null,null,null,null,"D","SARC- Unprotected Sets",8,3,null,55,4]
[3,"LKP- Pass It Around","A",8,{"$f":"VLOOKUP(B7,'NIGHT THREE'!M$3:N$34,2,FALSE)","v":8},{"$f":"VLOOKUP(B7,'NIGHT THREE'!M$3:O$34,3,FALSE)","v":3},8,{"$f":"VLOOKUP(B7,T$3:Y$34,5,FALSE)","v":53},5,3.8571428571428572,{"$f":"VLOOKUP($B7,'Team SB Donations'!B$5:L$36,11,FALSE)","v":12},4,23.857142857142858,null,null,null,null,null,"A","LKP- Pass It Around",8,3,null,53,5]
[4,"LKP- Will Play for Sets","A",8,{"$f":"VLOOKUP(B8,'NIGHT THREE'!M$3:N$34,2,FALSE)","v":9},{"$f":"VLOOKUP(B8,'NIGHT THREE'!M$3:O$34,3,FALSE)","v":2},9,{"$f":"VLOOKUP(B8,T$3:Y$34,5,FALSE)","v":71},3,4.1428571428571432,{"$f":"VLOOKUP($B8,'Team SB Donations'!B$5:L$36,11,FALSE)","v":20},2.4,23.542857142857141,null,null,null,null,null,"A","CT- Spikological Warfare",8,3,null,52,6]
[5,"NR- Six Pack Attack","A",8,{"$f":"VLOOKUP(B9,'NIGHT THREE'!M$3:N$34,2,FALSE)","v":7},{"$f":"VLOOKUP(B9,'NIGHT THREE'!M$3:O$34,3,FALSE)","v":4},7,{"$f":"VLOOKUP(B9,T$3:Y$34,5,FALSE)","v":45},10,3.1428571428571428,{"$f":"VLOOKUP($B9,'Team SB Donations'!B$5:L$36,11,FALSE)","v":13},3.8,21.942857142857143,null,null,null,null,null,"C","GS- Sand Gators",7,4,null,52,7]
[6,"LKP- Air Vectors","A",8,{"$f":"VLOOKUP(B10,'NIGHT THREE'!M$3:N$34,2,FALSE)","v":7},{"$f":"VLOOKUP(B10,'NIGHT THREE'!M$3:O$34,3,FALSE)","v":4},7,{"$f":"VLOOKUP($B10,T$3:Y$34,5,FALSE)","v":7},15,2.4285714285714284,{"$f":"VLOOKUP($B10,'Team SB Donations'!B$5:L$36,11,FALSE)","v":10},4.4000000000000004,21.828571428571429,null,null,null,null,null,"B","SARC- Sand Diggers",7,4,null,49,8]
{"$rows_left_out":27}
{"sheet":"Team SB Donations","index":6,"n_rows":36,"n_cols":19,"rows_kept":36,"cut":false,"hidden":false,"merged":[]}
[null,"St Baldrick's Download Team Report",null,null,"8/21/16  7am",null,null,null,null,null,null,null,null,1,2,3,4,5,6]
[]
[null,1,2,3,4,5,6,7,8,9,10,11,null,"2016-08-21T07:00:00"]
[null,"Schedule Name","Team Name","# of Participants","Team Captain Full Name","Team Captain Display Name","Team Fundraising Goal","Amount Raised","Sponsorships earned","Cash Sponsors acquired or other SB credits","Total","Growler Team Rank",null,"Team Name","# of Participants","Team Captain Full Name","Team Captain Display Name","Team Fundraising Goal","Amount Raised"]
[null,"SARC- Sand Diggers","Sand Diggers",5,"John M Marks","John Marks",3500,{"$f":"VLOOKUP($C5,N$5:S$36,6,FALSE)","v":5443},350,"Alvis Dent., misplaced SB",{"$f":"SUM(H5:I5)","v":5793},1,null,"Air vectors",3,"Lawrence R Lee","Lawrence Lee",300,1182]
[null,"SARC- Volleywood","Volleywood",7,"Jason P Grieco","Jason Grieco",4000,2775,null,null,2775,2,null,"Kiss My Ace!",3,"Olaf  Schroeder","Olaf Schroeder",500,900]
[null,"SARC- Dirt Devils","Mizfits",8,"Jay W Cupstid","Jay Cupstid",2000,1483,600,"BTM Landscape,  Alvis D",2083,3,null,"$et For Life",2,"Dan J Schaefer","Dan Schaefer",750,1020]
[null,"LKP- Block You Like a Hurricane","Dirt Devils",3,"Beth  Farrell","Beth Farrell",1000,450,1500,"Campbell Ortho",1950,4,null,"Bumpn' Uglies",1,"Kenneth  Muller","Kenneth Muller",500,515]
[null,"SO- Team Kona","Block You Like A Hurricane",5,"James  Perotti","James Perotti",400,1950,null,null,1950,5,null,"Casual Sets",1,"Dave  Radcliffe","Dave Radcliffe",500,505]
[null,"SARC- Mizfits","Team Kona",1,"Joe  Maierhofer","Joe Maierhofer",2000,1785,null,null,1785,6,null,"Will Play For Sets",5,"John D Allen","John Allen",500,825]
{"$rows_left_out":27}
{"sheet":"Teams","index":7,"n_rows":49,"n_cols":30,"rows_kept":49,"cut":false,"hidden":false,"merged":[]}
[null,null,null,null,null,null,null,null,null,null,null,null,null,null,null,null,null,null,null,null,null,null,null,"Division","Teams","Win","Loss",".","PT DIFF","Received Reg forms (Div request)"]
[null,null,null,null,null,null,null,null,null,null,null,null,null,null,null,null,null,null,null,null,null,null,null,"A","NR- Six Pack Attack",11,0,null,105,"A"]
[null,null,null,null,null,null,null,null,null,null,null,null,null,null,null,null,null,null,null,null,null,null,null,"A","SARC- Volleywood",8,3,null,64,"A"]
[null,null,null,null,null,null,null,null,null,null,null,null,null,null,null,null,null,null,null,null,null,null,null,"A","LKP- Air Vectors",8,3,null,52,"A"]
[null,null,null,null,null,null,null,null,null,null,null,null,null,null,null,null,null,null,null,null,null,null,null,"A","SO- Kiss My Ace",8,3,null,28,"A"]
[null,null,null,null,null,null,null,null,null,null,null,null,null,null,null,null,null,null,null,null,null,null,null,"A","LKP- Will Play for Sets",7,4,null,17,"A"]
[null,null,null,null,null,null,null,null,null,null,null,null,null,null,null,null,null,null,null,null,null,null,null,"A","LKP- Pass It Around",4,7,null,-11,"A"]
[null,null,null,null,null,null,null,null,null,null,null,null,null,null,null,null,null,null,null,null,null,null,"A","C","SARC- $et for Life",9,2,null,67,"A"]
[null,null,null,null,null,null,null,null,null,null,null,null,null,null,null,null,null,null,null,null,null,null,"CT #3  A","D","CT - Spikological Warfare",2,9,null,-74,"A"]
[null,null,null,null,null,null,null,null,null,null,null,null,null,null,null,null,null,null,null,null,null,null,null,"A","LKP- Casual Sets",6,5,null,6,"B"]
{"$rows_left_out":40}
{"sheet":"32 team Bracketology","index":8,"n_rows":39,"n_cols":20,"rows_kept":39,"cut":false,"hidden":false,"merged":[]}
["32 TEAM BRACKETOLOGY-  The method to this schedule Madness"]
[]
["Night 1","All at SARC- Play Within Your Bracket"]
[null,"Teams play a round robin with 3 teams in their same Bracket"]
[null," 8 Brackets of 4- 3 games each  "]
["Bracket",null,null,null,null,"Bracket"]
["A1",1,2,3,4,"A2",5,6,7,8,null,"A Division "]
[]
["C1",9,10,11,12,"C2",13,14,15,16,null,"C Division"]
[]
{"$rows_left_out":30}
{"sheet":"# of games per night","index":9,"n_rows":50,"n_cols":18,"rows_kept":50,"cut":false,"hidden":false,"merged":[]}
["Night 1","ALL at Springdale",null,null,null,null,null,null,null,null,"Nights 2 and 3",null,"  - 3 HOST CLUBS (SARC, LKP, and GS)"]
["# games","time","Courts",null,null,null,null,null,null,null,null,null,"8 courts at 4 Sites w/ SARC counting as 2 Sites"]
[1,"06:00:00","court 1",null,"32 teams",null,null,null,null,null,null,null,null,"SARC Red and SARC Bluelue to be one perm court and one temp sand court"]
[2,null,"court 2",null,"3 games each",null,null,null,null,null,1,6,"court 1"]
[3,null,"court 3",null,"(32*3)/2",null,null,null,null,null,2,null,"court 2",null,"SARC Red","SARC Blue","LPK","GS"]
[4,null,"court 4",null,{"$f":"(32*3)/2","v":48},null,null,"# of games",null,null,3,"06:30:00","court 1",null,"2 courts","2 courts","2 courts","2 courts"]
[5,null,"court 5",null,null,null,null,null,null,null,4,null,"court 2",null,"8 teams","8 teams","8 teams","8 teams"]
[6,null,"court 6",null,null,null,null,null,null,null,5,7,"court 1"]
[7,"06:30:00","court 1",null,"4 total Sand courts at SARC w/ 2 temp Sand",null,null,null,null,null,6,null,"court 2",null,"Each Site- 8 teams"]
[8,null,"court 2",null,"Courts 3 and 4 are temporary sand courts on the soccer field",null,null,null,null,null,7,"07:30:00","court 1",null,"4 games each",null,"# of Games"]
{"$rows_left_out":41}
{"sheet":"Team # Match ups","index":10,"n_rows":51,"n_cols":33,"rows_kept":51,"cut":false,"hidden":false,"merged":[]}
["Night 1",null,null,null,null,null,null,null,null,null,null,null,"Night 2",null,null,null,null,null,null,null,null,null,null,null,"Night 3"]
[]
["# games","Bracket","Team  VS","Team",null,null,null,null,null,null,null,null,"# games","Bracket","Team  VS","Team",null,null,"# games","Bracket","Team  VS","Team",null,null,"# games","Bracket","Team  VS","Team",null,"# games","Bracket","Team  VS","Team"]
[1,"A",1,2,null,null,null,null,null,null,null,null,1,"SARC Red",1,5,null,null,1,"SARC Blue",17,21,null,null,1,"SARC Red",1,9,null,1,"LPK",5,13]
[2,"A",1,3,null,null,null,null,null,null,null,null,2,"SARC Red",1,6,null,null,2,"SARC Blue",17,22,null,null,2,"SARC Red",1,17,null,2,"LPK",5,21]
[3,"A",4,1,null,null,null,null,null,null,null,null,3,"SARC Red",7,1,null,null,3,"SARC Blue",23,17,null,null,3,"SARC Red",25,1,null,3,"LPK",29,5]
[4,"A",2,3,null,null,null,null,null,null,null,null,4,"SARC Red",8,1,null,null,4,"SARC Blue",24,17,null,null,4,"SARC Red",17,9,null,4,"LPK",21,13]
[5,"A",2,4,null,null,null,null,null,null,null,null,5,"SARC Red",2,5,null,null,5,"SARC Blue",18,21,null,null,5,"SARC Red",9,25,null,5,"LPK",13,29]
[6,"A",3,4,null,null,null,null,null,null,null,null,6,"SARC Red",2,6,null,null,6,"SARC Blue",18,22,null,null,6,"SARC Red",17,25,null,6,"LPK",21,29]
[7,"B",5,6,null,null,null,null,null,null,null,null,7,"SARC Red",7,2,null,null,7,"SARC Blue",23,18,null,null,7,"SARC Red",10,1,null,7,"LPK",14,5]
{"$rows_left_out":41}